BDBM50370408 CHEMBL177435
SMILES CCCc1nc(c(C=O)n1Cc1ccc(cc1)-c1ccccc1-c1nnn[nH]1)-c1ccccc1
InChI Key InChIKey=BCIWORMDOSIUMY-UHFFFAOYSA-N
Data  1 IC50
  Tab Delimited (TSV)   2D SDfile   Computed 3D by Vconf -m prep SDfile
Find this compound or compounds like it in BindingDB:
Activity Spreadsheet -- Enzyme Inhibition Constant Data from BindingDB
Found 1 hit for monomerid = 50370408
TargetType-2 angiotensin II receptor(Homo sapiens (Human))
TBA
Curated by ChEMBL
LigandPNGBDBM50370408(CHEMBL177435)
Affinity DataIC50:  6.70nM. Assay description: In vitro binding affinity against angiotensin II AT-2 receptor
In DepthDetails ArticlePubMed