BDBM50370430 CHEMBL610300
SMILES Nc1ncnc2n(cnc12)C1O[C@H](CC(=O)OCCF)[C@@H](O)[C@H]1O
InChI Key InChIKey=GXMPVIIFQOAUTP-RHYXXNLNSA-N
Data  1 KI
  Tab Delimited (TSV)   2D SDfile   Computed 3D by Vconf -m prep SDfile
Find this compound or compounds like it in BindingDB:
Activity Spreadsheet -- Enzyme Inhibition Constant Data from BindingDB
Found 1 hit for monomerid = 50370430
TargetAdenosylhomocysteinase(Homo sapiens (Human))
Umr 6519
Curated by ChEMBL
LigandPNGBDBM50370430(CHEMBL610300)
Affinity DataKi:  7.50E+4nM. Assay description: Inhibition of human placental AdoHcy hydrolase
In DepthDetails ArticlePubMed