BDBM50370512 CHEMBL4172897
SMILES CC(C)c1ccc(NC(=O)Nc2ccc(CCNc3ncnc4oc(c(Cl)c34)-c3ccccc3)cc2)cc1
InChI Key InChIKey=XXIGRUYWGADOAW-UHFFFAOYSA-N
Data  2 IC50
  Tab Delimited (TSV)   2D SDfile   Computed 3D by Vconf -m prep SDfile
Find this compound or compounds like it in BindingDB:
Activity Spreadsheet -- Enzyme Inhibition Constant Data from BindingDB
Found 2 hits for monomerid = 50370512
TargetAurora kinase B(Homo sapiens (Human))
National Health Research Institutes
Curated by ChEMBL
LigandPNGBDBM50370512(CHEMBL4172897)
Affinity DataIC50: >1.00E+3nM. Assay description: Inhibition of human recombinant full length Aurora-B (1 to 344 residues) expressed in Sf9 cells after 90 mins by kinase-glo luminescence assay
In DepthDetails ArticlePubMed
TargetAurora kinase A(Homo sapiens (Human))
National Health Research Institutes
Curated by ChEMBL
LigandPNGBDBM50370512(CHEMBL4172897)
Affinity DataIC50: >1.00E+3nM. Assay description: Inhibition of GST-tagged human recombinant Aurora A kinase domain (123 to 401 residues) expressed in Sf9 cells after 120 mins by kinase-glo luminesce...
In DepthDetails ArticlePubMed