BDBM50370543 CHEMBL610849
SMILES CCCN(CCC)S(=O)(=O)c1ccc(NC(=O)Nc2ncnc3n(cnc23)C2O[C@@H]([C@@H](O)[C@H]2O)C(=O)NCC)cc1
InChI Key InChIKey=YMMCGFOMYASSRW-PHTWQSKTSA-N
Data  3 KI
  Tab Delimited (TSV)   2D SDfile   Computed 3D by Vconf -m prep SDfile
Find this compound or compounds like it in BindingDB:
Activity Spreadsheet -- Enzyme Inhibition Constant Data from BindingDB
Found 3 hits for monomerid = 50370543
TargetAdenosine receptor A3(Homo sapiens (Human))
Universit£
Curated by ChEMBL
LigandPNGBDBM50370543(CHEMBL610849)
Affinity DataKi:  14nM. Assay description: Displacement of [125I]AB-MECA binding to Adenosine A3 receptor expressed in CHO cells
In DepthDetails ArticlePubMed
TargetAdenosine receptor A1(Homo sapiens (Human))
Universit£
Curated by ChEMBL
LigandPNGBDBM50370543(CHEMBL610849)
Affinity DataKi:  350nM. Assay description: Displacement of [3H]CHA binding to Adenosine A1 receptor expressed in CHO cells
In DepthDetails ArticlePubMed
TargetAdenosine receptor A2a(Homo sapiens (Human))
Universit£
Curated by ChEMBL
LigandPNGBDBM50370543(CHEMBL610849)
Affinity DataKi: >1.00E+3nM. Assay description: Displacement of [3H]CGS-21680 binding to Adenosine A2 receptor expressed in CHO cells
In DepthDetails ArticlePubMed