BDBM50370558 CHEMBL609376
SMILES OC[C@H]1OC([C@H](O)[C@@H]1O)n1c(nc2c(SCc3ccccc3)ncnc12)N1CCCC1
InChI Key InChIKey=DUACVZOIDOBZNS-FIALEDGQSA-N
Data  1 KI
  Tab Delimited (TSV)   2D SDfile   Computed 3D by Vconf -m prep SDfile
Find this compound or compounds like it in BindingDB:
Activity Spreadsheet -- Enzyme Inhibition Constant Data from BindingDB
Found 1 hit for monomerid = 50370558
TargetEquilibrative nucleoside transporter 1(Homo sapiens (Human))
Leiden University
Curated by ChEMBL
LigandPNGBDBM50370558(CHEMBL609376)
Affinity DataKi:  410nM. Assay description: Inhibition of [3H]NBTI binding to equilibrative nucleoside transport protein 1 (ENT1) in human erythrocyte membranes
In DepthDetails ArticlePubMed