BDBM50370563 CHEMBL609378
SMILES CCCNc1nc2c(SCc3ccccc3)ncnc2n1C1O[C@H](CO)[C@@H](O)[C@H]1O
InChI Key InChIKey=SQDWHYNKFJICLC-XAUNWSGPSA-N
Data  1 KI
  Tab Delimited (TSV)   2D SDfile   Computed 3D by Vconf -m prep SDfile
Find this compound or compounds like it in BindingDB:
Activity Spreadsheet -- Enzyme Inhibition Constant Data from BindingDB
Found 1 hit for monomerid = 50370563
TargetEquilibrative nucleoside transporter 1(Homo sapiens (Human))
Leiden University
Curated by ChEMBL
LigandPNGBDBM50370563(CHEMBL609378)
Affinity DataKi:  5.30nM. Assay description: Inhibition of [3H]NBTI binding to equilibrative nucleoside transport protein 1 (ENT1) in human erythrocyte membranes
In DepthDetails ArticlePubMed