BDBM50370567 CHEMBL608795
SMILES OC[C@H]1OC([C@H](O)[C@@H]1O)n1c(NC2CCCCC2)nc2c(SCc3ccccc3)ncnc12
InChI Key InChIKey=GKDZQBOOQRTTOH-BEBASYGKSA-N
Data  1 KI
  Tab Delimited (TSV)   2D SDfile   Computed 3D by Vconf -m prep SDfile
Find this compound or compounds like it in BindingDB:
Activity Spreadsheet -- Enzyme Inhibition Constant Data from BindingDB
Found 1 hit for monomerid = 50370567
TargetEquilibrative nucleoside transporter 1(Homo sapiens (Human))
Leiden University
Curated by ChEMBL
LigandPNGBDBM50370567(CHEMBL608795)
Affinity DataKi:  0.940nM. Assay description: Inhibition of [3H]NBTI binding to equilibrative nucleoside transport protein 1 (ENT1) in human erythrocyte membranes
In DepthDetails ArticlePubMed