BDBM50370650 CHEMBL1791331
SMILES CC[C@H](C)[C@@H](NC(=O)[C@H]([C@H](C)O)N(C)C(=O)CCCCCCCCCCCCCCC(=O)N[C@H](C(C)C)C(=O)N[C@@H](Cc1ccccc1)C(O)=O)C(=O)NC(CO)C(N)=O
InChI Key InChIKey=FOMKYBOVQHZDRZ-HSXKJBDKSA-N
Data  1 KI
  Tab Delimited (TSV)   2D SDfile   Computed 3D by Vconf -m prep SDfile
Find this compound or compounds like it in BindingDB:
Activity Spreadsheet -- Enzyme Inhibition Constant Data from BindingDB
Found 1 hit for monomerid = 50370650
TargetGag-Pol polyprotein [489-587](Human immunodeficiency virus type 1)
Purdue University
Curated by ChEMBL
LigandPNGBDBM50370650(CHEMBL1791331)
Affinity DataKi:  202nM. Assay description: Inhibitory concentration against human immunodeficiency virus -1 protease
In DepthDetails ArticlePubMed