BDBM50370753 CHEMBL1791383
SMILES CC[C@H](C)[C@H](NC(=O)[C@H](Cc1ccc(O)cc1)NC(=O)[C@@H]1CCCN1C(=O)[C@H](CCCNC(N)=N)NCC(CCCCN)NC(=O)CNC(=O)C(CNCCN)CNCCN)C(=O)N[C@@H](CC(C)C)C(O)=O
InChI Key InChIKey=DMDCNLGMRLTMHD-PLXGHWBHSA-N
Data  2 IC50
  Tab Delimited (TSV)   2D SDfile   Computed 3D by Vconf -m prep SDfile
Find this compound or compounds like it in BindingDB:
Activity Spreadsheet -- Enzyme Inhibition Constant Data from BindingDB
Found 2 hits for monomerid = 50370753
TargetNeurotensin receptor type 1(Homo sapiens (Human))
National Center For Scientific Research Demokritos
Curated by ChEMBL
LigandPNGBDBM50370753(CHEMBL1791383)
Affinity DataIC50:  0.410nM. Assay description: Displacement of [125I]Tyr3-NT from human NTS1R expressed in HT29 cells
In DepthDetails ArticlePubMed
TargetNeurotensin receptor type 1(Homo sapiens (Human))
National Center For Scientific Research Demokritos
Curated by ChEMBL
LigandPNGBDBM50370753(CHEMBL1791383)
Affinity DataIC50:  0.180nM. Assay description: Displacement of [125I]Tyr3-NT from human NTS1R expressed in WiDr cells
In DepthDetails ArticlePubMed