BDBM50371159 CHEMBL390274
SMILES CCCCN(C)c1ccc2nc(-c3ccccc3OC)n(CC3CCCNC3)c(=O)c2c1
InChI Key InChIKey=QTMCHHWITGOFQV-UHFFFAOYSA-N
Data  1 KI
  Tab Delimited (TSV)   2D SDfile   Computed 3D by Vconf -m prep SDfile
Find this compound or compounds like it in BindingDB:
Activity Spreadsheet -- Enzyme Inhibition Constant Data from BindingDB
Found 1 hit for monomerid = 50371159
TargetGrowth hormone secretagogue receptor type 1(Ovis aries)
Bayer Pharmaceuticals
Curated by ChEMBL
LigandPNGBDBM50371159(CHEMBL390274)
Affinity DataKi:  36nM. Assay description: Displacement of [125I]ghrelin from ovine recombinant GHSR1a expressed in HEK293F cells after 6 hrs by scintillation proximity assay
In DepthDetails ArticlePubMed