BDBM50371198 CHEMBL540131
SMILES CC[N+](CC)(CC)CCOc1ccc(cc1)C(=O)NCCCCCC(=O)NNc1c2CCCCc2nc2cc(Cl)ccc12
InChI Key InChIKey=SRSKXXPERFQRQE-UHFFFAOYSA-O
Data  3 IC50  1 EC50
  Tab Delimited (TSV)   2D SDfile   Computed 3D by Vconf -m prep SDfile
Find this compound or compounds like it in BindingDB:
Activity Spreadsheet -- Enzyme Inhibition Constant Data from BindingDB
Found 4 hits for monomerid = 50371198
TargetAcetylcholinesterase(Tetronarce californica (Pacific electric ray) (Tor...)
University Of Bonn
Curated by ChEMBL
LigandPNGBDBM50371198(CHEMBL540131)
Affinity DataIC50:  127nM. Assay description: Inhibition of Torpedo californica Acetylcholinesterase
In DepthDetails ArticlePubMed
TargetMuscarinic acetylcholine receptor M2(GUINEA PIG)
University Of Bonn
Curated by ChEMBL
LigandPNGBDBM50371198(CHEMBL540131)
Affinity DataEC50:  5nM. Assay description: Inhibition of [3H]NMS dissociation from porcine muscarinic M2 receptor
In DepthDetails ArticlePubMed
TargetAcetylcholinesterase(Electrophorus electricus (Electric eel))
University Of Bonn
Curated by ChEMBL
LigandPNGBDBM50371198(CHEMBL540131)
Affinity DataIC50:  26nM. Assay description: Inhibition of Electrophorus electricus Acetylcholinesterase
In DepthDetails ArticlePubMed
TargetAcetylcholinesterase(Homo sapiens (Human))
University Of Bonn
Curated by ChEMBL
LigandPNGBDBM50371198(CHEMBL540131)
Affinity DataIC50:  5.44nM. Assay description: Inhibition of human Acetylcholinesterase
In DepthDetails ArticlePubMed