BDBM50371199 CHEMBL540132
SMILES CC[N+](CC)(CC)CCOc1cc(OCC[N+](CC)(CC)CC)cc(c1)C(=O)NCCCCCC(=O)NNc1c2CCCCc2nc2cc(Cl)ccc12
InChI Key InChIKey=HSAIXSYFGMGWPJ-UHFFFAOYSA-P
Data  3 IC50  1 EC50
  Tab Delimited (TSV)   2D SDfile   Computed 3D by Vconf -m prep SDfile
Find this compound or compounds like it in BindingDB:
Activity Spreadsheet -- Enzyme Inhibition Constant Data from BindingDB
Found 4 hits for monomerid = 50371199
TargetMuscarinic acetylcholine receptor M2(GUINEA PIG)
University Of Bonn
Curated by ChEMBL
LigandPNGBDBM50371199(CHEMBL540132)
Affinity DataEC50:  1.5nM. Assay description: Inhibition of [3H]NMS dissociation from porcine muscarinic M2 receptor
In DepthDetails ArticlePubMed
TargetAcetylcholinesterase(Tetronarce californica (Pacific electric ray) (Tor...)
University Of Bonn
Curated by ChEMBL
LigandPNGBDBM50371199(CHEMBL540132)
Affinity DataIC50:  301nM. Assay description: Inhibition of Torpedo californica Acetylcholinesterase
In DepthDetails ArticlePubMed
TargetAcetylcholinesterase(Homo sapiens (Human))
University Of Bonn
Curated by ChEMBL
LigandPNGBDBM50371199(CHEMBL540132)
Affinity DataIC50:  6.75nM. Assay description: Inhibition of human Acetylcholinesterase
In DepthDetails ArticlePubMed
TargetAcetylcholinesterase(Electrophorus electricus (Electric eel))
University Of Bonn
Curated by ChEMBL
LigandPNGBDBM50371199(CHEMBL540132)
Affinity DataIC50:  48nM. Assay description: Inhibition of Electrophorus electricus Acetylcholinesterase
In DepthDetails ArticlePubMed