BDBM50371210 CHEMBL247879
SMILES CN(C)Cc1ccc(cc1)-c1cc2onc(-c3ccccc3)c2c(=O)n1C
InChI Key InChIKey=NOHFHPIPRSKJQF-UHFFFAOYSA-N
Data  1 IC50  1 EC50
  Tab Delimited (TSV)   2D SDfile   Computed 3D by Vconf -m prep SDfile
Find this compound or compounds like it in BindingDB:
Activity Spreadsheet -- Enzyme Inhibition Constant Data from BindingDB
Found 2 hits for monomerid = 50371210
TargetdCTP pyrophosphatase 1(Homo sapiens (Human))
Karolinska Institutet
Curated by ChEMBL
LigandPNGBDBM50371210(CHEMBL247879)
Affinity DataIC50:  900nM. Assay description: Inhibitory activity against Coagulation factor X
In DepthDetails ArticlePubMed
TargetNuclear receptor subfamily 4 group A member 2(Homo sapiens (Human))
Novartis Institutes For Biomedical Research
Curated by ChEMBL
LigandPNGBDBM50371210(CHEMBL247879)
Affinity DataEC50:  26nM. Assay description: Activation of Nurr1 expressed in MN9D cells by luciferase reporter gene assay
In DepthDetails ArticlePubMed