BDBM50371599 CHEMBL1162169
SMILES OP(=O)(OC[C@H]1O[C@H]([C@@H]2OC(Cc3ccccc3)O[C@H]12)n1ccc(=O)[nH]c1=O)OP(O)(=O)OP(O)(=O)OC[C@@H]1O[C@@H]([C@H]2OC(Cc3ccccc3)O[C@@H]12)n1ccc(=O)[nH]c1=O
InChI Key InChIKey=NLTYKKYJCVENAL-HWRQHDFZSA-N
Data  1 IC50
  Tab Delimited (TSV)   2D SDfile   Computed 3D by Vconf -m prep SDfile
Find this compound or compounds like it in BindingDB:
Activity Spreadsheet -- Enzyme Inhibition Constant Data from BindingDB
Found 1 hit for monomerid = 50371599
TargetP2Y purinoceptor 12(Homo sapiens (Human))
Inspire Pharmaceuticals
Curated by ChEMBL
LigandPNGBDBM50371599(CHEMBL1162169)
Affinity DataIC50:  4.63E+3nM. Assay description: Antagonist activity at P2Y12 receptor assessed as inhibition of ADP-induced human platelet aggregation by washed platelet assay
In DepthDetails ArticlePubMed