BDBM50371866 CHEMBL257906
SMILES CO[C@@H]1CN(C[C@H]2Cc3ccc(Br)cc3C2)CC[C@H]1n1c(nc2cc(C)ccc12)C(C)(C)O
InChI Key InChIKey=NNGIOOYYOUWXAP-PISWEHOVSA-N
Data  1 KI  2 EC50
  Tab Delimited (TSV)   2D SDfile   Computed 3D by Vconf -m prep SDfile
Find this compound or compounds like it in BindingDB:
Activity Spreadsheet -- Enzyme Inhibition Constant Data from BindingDB
Found 3 hits for monomerid = 50371866
TargetMelanin-concentrating hormone receptor 1(Homo sapiens (Human))
Hoffmann-La Roche
Curated by ChEMBL
LigandPNGBDBM50371866(CHEMBL257906)
Affinity DataKi:  10nM. Assay description: Binding affinity to MCHR1
In DepthDetails ArticlePubMed
TargetMu-type opioid receptor(Homo sapiens (Human))
Hoffmann-La Roche
Curated by ChEMBL
LigandPNGBDBM50371866(CHEMBL257906)
Affinity DataEC50:  2.49E+4nM. Assay description: Agonist activity at mu opioid receptor
In DepthDetails ArticlePubMed
TargetMelanin-concentrating hormone receptor 1(Homo sapiens (Human))
Hoffmann-La Roche
Curated by ChEMBL
LigandPNGBDBM50371866(CHEMBL257906)
Affinity DataEC50:  30nM. Assay description: Antagonist activity at MCHR1 by cAMP assay
In DepthDetails ArticlePubMed