BDBM50372013 CHEMBL256190
SMILES CC(=O)N1C2CCCC1C=C(CN1CCC(CC1)Nc1ccc3cc(Cl)ccc3n1)C2
InChI Key InChIKey=YJVGVOJVWTYFEB-UHFFFAOYSA-N
Data  1 KI
  Tab Delimited (TSV)   2D SDfile   Computed 3D by Vconf -m prep SDfile
Find this compound or compounds like it in BindingDB:
Activity Spreadsheet -- Enzyme Inhibition Constant Data from BindingDB
Found 1 hit for monomerid = 50372013
TargetC-X-C chemokine receptor type 3(Homo sapiens (Human))
Ucb Pharma
Curated by ChEMBL
LigandPNGBDBM50372013(CHEMBL256190)
Affinity DataKi:  26nM. Assay description: Binding affinity to CXCR3 receptor expressed in CHO cells assessed as ITAC-induced [35]GTPgammaS binding
In DepthDetails ArticlePubMed