BDBM50372178 CHEMBL406312
SMILES OC(=O)[C@H](Cc1ccccc1)N1C(=S)S\C(=C/c2ccc(OCOc3ccc(\C=C4/SC(=S)N([C@@H](Cc5ccccc5)C(O)=O)C4=O)cc3)cc2)C1=O
InChI Key InChIKey=KYTPZOARRDNICZ-TWLRFMQXSA-N
Data  3 KI
  Tab Delimited (TSV)   2D SDfile   Computed 3D by Vconf -m prep SDfile
Find this compound or compounds like it in BindingDB:
Activity Spreadsheet -- Enzyme Inhibition Constant Data from BindingDB
Found 3 hits for monomerid = 50372178
TargetBcl-2-like protein 2(Homo sapiens (Human))
University Of Minnesota Minneapolis
Curated by ChEMBL
LigandPNGBDBM50372178(CHEMBL406312)
Affinity DataKi:  2.30E+3nM. Assay description: Inhibition of Bak peptide binding to human recombinant Bcl-w
In DepthDetails ArticlePubMed
TargetBcl2-associated agonist of cell death(Homo sapiens (Human))
University Of Minnesota Minneapolis
Curated by ChEMBL
LigandPNGBDBM50372178(CHEMBL406312)
Affinity DataKi:  2.40E+3nM. Assay description: Inhibition of Bak peptide binding to human recombinant Bcl-Xl
In DepthDetails ArticlePubMed
TargetApoptosis regulator Bcl-2(Homo sapiens (Human))
University Of Minnesota Minneapolis
Curated by ChEMBL
LigandPNGBDBM50372178(CHEMBL406312)
Affinity DataKi:  4.30E+3nM. Assay description: Inhibition of Bak peptide binding to human recombinant Bcl2
In DepthDetails ArticlePubMed