BDBM50372513 CHEMBL256204
SMILES Cc1ccc2cccc(NS(=O)(=O)c3ccccc3[N+]([O-])=O)c2n1
InChI Key InChIKey=YMHFQDFREPFUMV-UHFFFAOYSA-N
Data  1 IC50  2 EC50
  Tab Delimited (TSV)   2D SDfile   Computed 3D by Vconf -m prep SDfile
Find this compound or compounds like it in BindingDB:
Activity Spreadsheet -- Enzyme Inhibition Constant Data from BindingDB
Found 3 hits for monomerid = 50372513
TargetNF-kappa-B inhibitor alpha(Homo sapiens (Human))
Columbia University
Curated by ChEMBL
LigandPNGBDBM50372513(CHEMBL256204)
Affinity DataEC50:  6.80E+3nM. Assay description: Induction of human IkappaBalpha stabilization in OCI-Ly3 cells by green light emiting IkappaBalpha-fused luciferase reporter gene assay
In DepthDetails ArticlePubMed
TargetNF-kappa-B inhibitor alpha(Homo sapiens (Human))
Columbia University
Curated by ChEMBL
LigandPNGBDBM50372513(CHEMBL256204)
Affinity DataEC50:  8.00E+3nM. Assay description: Induction of human IkappaBalpha stabilization in OCI-Ly3 cells assessed as ratio of green light emiting IkappaBalpha-fused luciferase expression to r...
In DepthDetails ArticlePubMed
TargetTranscription factor p65(Homo sapiens (Human))
Columbia University
Curated by ChEMBL
LigandPNGBDBM50372513(CHEMBL256204)
Affinity DataIC50:  3.80E+3nM. Assay description: Inhibition of TNF-alpha-stimulated human NF-kappaB p65 RelA subunit nuclear translocation in HUVEC
In DepthDetails ArticlePubMed