BDBM50372554 CHEMBL258295
SMILES [#7]-[#6@H](-[#6]-c1ccc(F)cc1)-[#6](=O)-[#7]-[#6@H](-[#6]-[#6]-[#6]\[#7]=[#6](\[#7])-[#7])-[#6]-c1ccccc1
InChI Key InChIKey=FWXWLUZMESYEFC-RTBURBONSA-N
Data  3 KI  2 EC50
  Tab Delimited (TSV)   2D SDfile   Computed 3D by Vconf -m prep SDfile
Find this compound or compounds like it in BindingDB:
Activity Spreadsheet -- Enzyme Inhibition Constant Data from BindingDB
Found 5 hits for monomerid = 50372554
TargetMelanocortin receptor 3(Homo sapiens (Human))
Nanyang Technological University
Curated by ChEMBL
LigandPNGBDBM50372554(CHEMBL258295)
Affinity DataKi:  3.50E+3nM. Assay description: Displacement of europium labeled NDP-alpha-MSH from human MC3 receptor expressed in HEK293 cells
In DepthDetails ArticlePubMed
TargetMelanocortin receptor 4(Homo sapiens (Human))
Nanyang Technological University
Curated by ChEMBL
LigandPNGBDBM50372554(CHEMBL258295)
Affinity DataKi:  4.20E+3nM. Assay description: Displacement of europium labeled NDP-alpha-MSH from human MC4 receptor expressed in HEK293 cells
In DepthDetails ArticlePubMed
TargetMelanocyte-stimulating hormone receptor(Homo sapiens (Human))
Nanyang Technological University
Curated by ChEMBL
LigandPNGBDBM50372554(CHEMBL258295)
Affinity DataKi: >2.50E+4nM. Assay description: Displacement of europium labeled NDP-alpha-MSH from human MC1 receptor expressed in HEK293 cells
In DepthDetails ArticlePubMed
TargetMelanocortin receptor 3(Homo sapiens (Human))
Nanyang Technological University
Curated by ChEMBL
LigandPNGBDBM50372554(CHEMBL258295)
Affinity DataEC50: >1.00E+5nM. Assay description: Agonist activity at human MC3 receptor expressed in HEK293 cells
In DepthDetails ArticlePubMed
TargetMelanocortin receptor 4(Homo sapiens (Human))
Nanyang Technological University
Curated by ChEMBL
LigandPNGBDBM50372554(CHEMBL258295)
Affinity DataEC50: >1.00E+5nM. Assay description: Agonist activity at human MC4 receptor expressed in HEK293 cells
In DepthDetails ArticlePubMed