BDBM50372633 CHEMBL270502
SMILES COc1ccc(CNC(=O)c2ccc3ncn(Cc4ccc(cc4)C(O)=O)c(=O)c3c2)cc1
InChI Key InChIKey=WMRPTLRLGQOISA-UHFFFAOYSA-N
Data  2 IC50
  Tab Delimited (TSV)   2D SDfile   Computed 3D by Vconf -m prep SDfile
Find this compound or compounds like it in BindingDB:
Activity Spreadsheet -- Enzyme Inhibition Constant Data from BindingDB
Found 2 hits for monomerid = 50372633
TargetCollagenase 3(Homo sapiens (Human))
Pfizer
Curated by ChEMBL
LigandPNGBDBM50372633(CHEMBL270502)
Affinity DataIC50:  1.61nM. Assay description: Inhibition of human MMP13 catalytic domain
In DepthDetails ArticlePubMed
TargetCollagenase 3(Homo sapiens (Human))
Pfizer
Curated by ChEMBL
LigandPNGBDBM50372633(CHEMBL270502)
Affinity DataIC50:  11nM. Assay description: Inhibition of human MMP13
In DepthDetails ArticlePubMed