BDBM50372662 CHEMBL272877
SMILES NS(=O)(=O)c1ccc(cc1)-c1cn(nn1)[C@@H]1O[C@H](CO)[C@H](O)[C@H](O)[C@H]1O
InChI Key InChIKey=OHQURRXQRSULTO-MBJXGIAVSA-N
Data  8 KI
  Tab Delimited (TSV)   2D SDfile   Computed 3D by Vconf -m prep SDfile
Find this compound or compounds like it in BindingDB:
Activity Spreadsheet -- Enzyme Inhibition Constant Data from BindingDB
Found 8 hits for monomerid = 50372662
TargetCarbonic anhydrase 2(Homo sapiens (Human))
Griffith University
Curated by ChEMBL
LigandPNGBDBM50372662(CHEMBL272877)
Affinity DataKi:  6.70nM. Assay description: Inhibition of human carbonic anhydrase 2 by stopped-flow CO2 hydration assay
In DepthDetails ArticlePubMed
TargetCarbonic anhydrase 2(Homo sapiens (Human))
Griffith University
Curated by ChEMBL
LigandPNGBDBM50372662(CHEMBL272877)
Affinity DataKi:  8.80nM. Assay description: Inhibition of human cloned CA2 by CO2 hydration method
In DepthDetails ArticlePubMed
TargetCarbonic anhydrase 1(Homo sapiens (Human))
Griffith University
Curated by ChEMBL
LigandPNGBDBM50372662(CHEMBL272877)
Affinity DataKi:  9.30nM. Assay description: Inhibition of human cloned CA1 by CO2 hydration method
In DepthDetails ArticlePubMed
TargetCarbonic anhydrase 14(Homo sapiens (Human))
Griffith University
Curated by ChEMBL
LigandPNGBDBM50372662(CHEMBL272877)
Affinity DataKi:  20nM. Assay description: Inhibition of human carbonic anhydrase 14 by stopped-flow CO2 hydration assay
In DepthDetails ArticlePubMed
TargetCarbonic anhydrase 12(Homo sapiens (Human))
Griffith University
Curated by ChEMBL
LigandPNGBDBM50372662(CHEMBL272877)
Affinity DataKi:  36nM. Assay description: Inhibition of human carbonic anhydrase 12 by stopped-flow CO2 hydration assay
In DepthDetails ArticlePubMed
TargetCarbonic anhydrase 9(Homo sapiens (Human))
Griffith University
Curated by ChEMBL
LigandPNGBDBM50372662(CHEMBL272877)
Affinity DataKi:  120nM. Assay description: Inhibition of human CA9 catalytic domain by CO2 hydration method
In DepthDetails ArticlePubMed
TargetCarbonic anhydrase 9(Homo sapiens (Human))
Griffith University
Curated by ChEMBL
LigandPNGBDBM50372662(CHEMBL272877)
Affinity DataKi:  126nM. Assay description: Inhibition of human carbonic anhydrase 9 by stopped-flow CO2 hydration assay
In DepthDetails ArticlePubMed
TargetCarbonic anhydrase 1(Homo sapiens (Human))
Griffith University
Curated by ChEMBL
LigandPNGBDBM50372662(CHEMBL272877)
Affinity DataKi:  7.95E+3nM. Assay description: Inhibition of human carbonic anhydrase 1 by stopped-flow CO2 hydration assay
In DepthDetails ArticlePubMed