BDBM50372668 CHEMBL437092
SMILES CC(=O)OC[C@H]1O[C@H]([C@H](OC(C)=O)[C@@H](OC(C)=O)[C@H]1OC(C)=O)n1cc(nn1)-c1ccc(cc1)S(N)(=O)=O
InChI Key InChIKey=SJIOLEJMBXAEAX-CDJZJNNCSA-N
Data  8 KI
  Tab Delimited (TSV)   2D SDfile   Computed 3D by Vconf -m prep SDfile
Find this compound or compounds like it in BindingDB:
Activity Spreadsheet -- Enzyme Inhibition Constant Data from BindingDB
Found 8 hits for monomerid = 50372668
TargetCarbonic anhydrase 2(Homo sapiens (Human))
Griffith University
Curated by ChEMBL
LigandPNGBDBM50372668(CHEMBL437092)
Affinity DataKi:  8.70nM. Assay description: Inhibition of human carbonic anhydrase 2 by stopped-flow CO2 hydration assay
In DepthDetails ArticlePubMed
TargetCarbonic anhydrase 2(Homo sapiens (Human))
Griffith University
Curated by ChEMBL
LigandPNGBDBM50372668(CHEMBL437092)
Affinity DataKi:  8.70nM. Assay description: Inhibition of human cloned CA2 by CO2 hydration method
In DepthDetails ArticlePubMed
TargetCarbonic anhydrase 12(Homo sapiens (Human))
Griffith University
Curated by ChEMBL
LigandPNGBDBM50372668(CHEMBL437092)
Affinity DataKi:  9.70nM. Assay description: Inhibition of human carbonic anhydrase 12 by stopped-flow CO2 hydration assay
In DepthDetails ArticlePubMed
TargetCarbonic anhydrase 14(Homo sapiens (Human))
Griffith University
Curated by ChEMBL
LigandPNGBDBM50372668(CHEMBL437092)
Affinity DataKi:  16nM. Assay description: Inhibition of human carbonic anhydrase 14 by stopped-flow CO2 hydration assay
In DepthDetails ArticlePubMed
TargetCarbonic anhydrase 9(Homo sapiens (Human))
Griffith University
Curated by ChEMBL
LigandPNGBDBM50372668(CHEMBL437092)
Affinity DataKi:  110nM. Assay description: Inhibition of human CA9 catalytic domain by CO2 hydration method
In DepthDetails ArticlePubMed
TargetCarbonic anhydrase 9(Homo sapiens (Human))
Griffith University
Curated by ChEMBL
LigandPNGBDBM50372668(CHEMBL437092)
Affinity DataKi:  110nM. Assay description: Inhibition of human carbonic anhydrase 9 by stopped-flow CO2 hydration assay
In DepthDetails ArticlePubMed
TargetCarbonic anhydrase 1(Homo sapiens (Human))
Griffith University
Curated by ChEMBL
LigandPNGBDBM50372668(CHEMBL437092)
Affinity DataKi:  4.30E+3nM. Assay description: Inhibition of human cloned CA1 by CO2 hydration method
In DepthDetails ArticlePubMed
TargetCarbonic anhydrase 1(Homo sapiens (Human))
Griffith University
Curated by ChEMBL
LigandPNGBDBM50372668(CHEMBL437092)
Affinity DataKi:  4.30E+3nM. Assay description: Inhibition of human carbonic anhydrase 1 by stopped-flow CO2 hydration assay
In DepthDetails ArticlePubMed