BDBM50372686 CHEMBL271401
SMILES O[C@@H](CNCCc1ccc(cc1)-c1ccc(C(O)=O)c(OC2CCOCC2)c1)c1ccccc1
InChI Key InChIKey=RZNALFDDJKMHAG-SANMLTNESA-N
Data  2 EC50
  Tab Delimited (TSV)   2D SDfile   Computed 3D by Vconf -m prep SDfile
Find this compound or compounds like it in BindingDB:
Activity Spreadsheet -- Enzyme Inhibition Constant Data from BindingDB
Found 2 hits for monomerid = 50372686
TargetBeta-3 adrenergic receptor(Homo sapiens (Human))
Astellas Pharma
Curated by ChEMBL
LigandPNGBDBM50372686(CHEMBL271401)
Affinity DataEC50:  4nM. Assay description: Agonist activity at human beta3 adrenergic receptor expressed in CHO cells assessed as cAMP accumulation by EIA
In DepthDetails ArticlePubMed
TargetBeta-1 adrenergic receptor(Homo sapiens (Human))
Astellas Pharma
Curated by ChEMBL
LigandPNGBDBM50372686(CHEMBL271401)
Affinity DataEC50: >1.00E+3nM. Assay description: Agonist activity at human beta-1 adrenergic receptor expressed in CHO cells assessed as cAMP accumulation by EIA
In DepthDetails ArticlePubMed