BDBM50372727 CHEMBL271686
SMILES CN(C)C(=O)[C@H]1S[C@H]([C@H](O)[C@@H]1O)n1cnc2c(NCc3cccc(Br)c3)nc(Cl)nc12
InChI Key InChIKey=QACVUZSNPPKTCI-MOROJQBDSA-N
Data  1 KI
  Tab Delimited (TSV)   2D SDfile   Computed 3D by Vconf -m prep SDfile
Find this compound or compounds like it in BindingDB:
Activity Spreadsheet -- Enzyme Inhibition Constant Data from BindingDB
Found 1 hit for monomerid = 50372727
TargetAdenosine receptor A3(Homo sapiens (Human))
Ewha Womans University
Curated by ChEMBL
LigandPNGBDBM50372727(CHEMBL271686)
Affinity DataKi:  9.32nM. Assay description: Displacement of [3H]ABMECA from human adenosine A3 receptor expressed in CHO cells
In DepthDetails ArticlePubMed