BDBM50373524 CHEMBL403924
SMILES CC(C)[C@H](NC(=O)CCN(C)C)c1cccc(F)c1N1CCN(CC1)C(=O)[C@@H]1CN(C[C@H]1c1cccc(Cl)c1)C(C)C
InChI Key InChIKey=PPTOSGVZGIFRJG-QXIHQKPUSA-N
Data  1 KI
  Tab Delimited (TSV)   2D SDfile   Computed 3D by Vconf -m prep SDfile
Find this compound or compounds like it in BindingDB:
Activity Spreadsheet -- Enzyme Inhibition Constant Data from BindingDB
Found 1 hit for monomerid = 50373524
TargetMelanocortin receptor 4(Homo sapiens (Human))
Neurocrine Biosciences
Curated by ChEMBL
LigandPNGBDBM50373524(CHEMBL403924)
Affinity DataKi:  370nM. Assay description: Displacement of [125I]NDP-MSH from human MC4 receptor expressed in HEK293 cells
In DepthDetails ArticlePubMed