BDBM50373565 CHEMBL271348
SMILES CS(=O)(=O)c1ccc(cc1)-c1nc(NCc2cccs2)cc(OC2CCCC2)n1
InChI Key InChIKey=UWEXWKJAXDNZFK-UHFFFAOYSA-N
Data  3 IC50
  Tab Delimited (TSV)   2D SDfile   Computed 3D by Vconf -m prep SDfile
Find this compound or compounds like it in BindingDB:
Activity Spreadsheet -- Enzyme Inhibition Constant Data from BindingDB
Found 3 hits for monomerid = 50373565
TargetProstaglandin G/H synthase 2(Homo sapiens (Human))
Faes Farma
Curated by ChEMBL
LigandPNGBDBM50373565(CHEMBL271348)
Affinity DataIC50:  7.5nM. Assay description: Inhibition of human COX2 in human whole blood
In DepthDetails ArticlePubMed
TargetProstaglandin G/H synthase 2(Homo sapiens (Human))
Faes Farma
Curated by ChEMBL
LigandPNGBDBM50373565(CHEMBL271348)
Affinity DataIC50:  1.33E+8nM. Assay description: Inhibition of COX2 in Homo sapiens (human) whole blood
In DepthDetails Article
TargetProstaglandin G/H synthase 2(Homo sapiens (Human))
Faes Farma
Curated by ChEMBL
LigandPNGBDBM50373565(CHEMBL271348)
Affinity DataIC50:  1.33E+8nM. Assay description: Inhibition of COX2 in Homo sapiens (human) whole blood
In DepthDetails Article