BDBM50373633 CHEMBL403622
SMILES CN(C1CCN(CC1)S(C)(=O)=O)C(=O)NC1CCN(CC1)c1ccc(Cl)cc1
InChI Key InChIKey=PDEKBIVGJUKSPI-UHFFFAOYSA-N
Data  1 KI
  Tab Delimited (TSV)   2D SDfile   Computed 3D by Vconf -m prep SDfile
Find this compound or compounds like it in BindingDB:
Activity Spreadsheet -- Enzyme Inhibition Constant Data from BindingDB
Found 1 hit for monomerid = 50373633
TargetNeuropeptide Y receptor type 5(Homo sapiens (Human))
Schering-Plough Research Institute
Curated by ChEMBL
LigandPNGBDBM50373633(CHEMBL403622)
Affinity DataKi:  130nM. Assay description: Displacement of [125]PYY from human chimeric NPY Y5 receptor expressed in CHOK1 cells
In DepthDetails ArticlePubMed