BDBM50373798 CHEMBL403087
SMILES C[C@H](N(C)C[C@@H](O)[C@H](Cc1ccccc1)NC(=O)c1cccc(c1)S(C)(=O)=O)C(=O)NC1CCCCC1
InChI Key InChIKey=CTLXKJIPWXBOCN-YMSRPXOMSA-N
Data  1 IC50
  Tab Delimited (TSV)   2D SDfile   Computed 3D by Vconf -m prep SDfile
Find this compound or compounds like it in BindingDB:
Activity Spreadsheet -- Enzyme Inhibition Constant Data from BindingDB
Found 1 hit for monomerid = 50373798
TargetBeta-secretase 1(Homo sapiens (Human))
Glaxosmithkline
Curated by ChEMBL
LigandPNGBDBM50373798(CHEMBL403087)
Affinity DataIC50: >5.00E+5nM. Assay description: Inhibition of BACE1
In DepthDetails ArticlePubMed