BDBM50373955 CHEMBL270842
SMILES CC(C)S(=O)(=O)n1c(N)nc2ccc(cc12)-c1[nH]c(C)nc1-c1ccc(F)cc1F
InChI Key InChIKey=PEMKWXLFTIDUIW-UHFFFAOYSA-N
Data  2 IC50
  Tab Delimited (TSV)   2D SDfile   Computed 3D by Vconf -m prep SDfile
Find this compound or compounds like it in BindingDB:
Activity Spreadsheet -- Enzyme Inhibition Constant Data from BindingDB
Found 2 hits for monomerid = 50373955
TargetMitogen-activated protein kinase 14(Mus musculus (mouse))
Eli Lilly
Curated by ChEMBL
LigandPNGBDBM50373955(CHEMBL270842)
Affinity DataIC50:  59.7nM. Assay description: Inhibition of mouse p38alpha in anisomycin-stimulated RAW 264.7 cells by ELISA
In DepthDetails ArticlePubMed
TargetMitogen-activated protein kinase 14(Homo sapiens (Human))
Eli Lilly
Curated by ChEMBL
LigandPNGBDBM50373955(CHEMBL270842)
Affinity DataIC50:  8.80nM. Assay description: Inhibition of human recombinant p38alpha
In DepthDetails ArticlePubMed