BDBM50374093 CHEMBL270241
SMILES O=C1CCCN1CCc1ccc(cc1)C1=CCC2CN(Cc3ccccc3)CC12
InChI Key InChIKey=ZBSRSMRKEMXADB-UHFFFAOYSA-N
Data  1 KI
  Tab Delimited (TSV)   2D SDfile   Computed 3D by Vconf -m prep SDfile
Find this compound or compounds like it in BindingDB:
Activity Spreadsheet -- Enzyme Inhibition Constant Data from BindingDB
Found 1 hit for monomerid = 50374093
TargetHistamine H3 receptor(Rattus norvegicus (rat))
Arena Pharmaceuticals
Curated by ChEMBL
LigandPNGBDBM50374093(CHEMBL270241)
Affinity DataKi:  310nM. Assay description: Displacement of N-[3H]methylhistamine from histamine H3 receptor in rat cortex
In DepthDetails ArticlePubMed