BDBM50374109 CHEMBL255840
SMILES CC(C)N1C[C@@H]2CC=C([C@@H]2C1)c1ccc(CCN2CCCC2)cc1
InChI Key InChIKey=XYXLEKOLPWSLEV-RBBKRZOGSA-N
Data  1 KI
  Tab Delimited (TSV)   2D SDfile   Computed 3D by Vconf -m prep SDfile
Find this compound or compounds like it in BindingDB:
Activity Spreadsheet -- Enzyme Inhibition Constant Data from BindingDB
Found 1 hit for monomerid = 50374109
TargetHistamine H3 receptor(Rattus norvegicus (rat))
Arena Pharmaceuticals
Curated by ChEMBL
LigandPNGBDBM50374109(CHEMBL255840)
Affinity DataKi:  0.290nM. Assay description: Displacement of N-[3H]methylhistamine from histamine H3 receptor in rat cortex
In DepthDetails ArticlePubMed