BDBM50374113 CHEMBL255847
SMILES C(Cc1ccc(cc1)C1=CCC2CN(CC12)c1ncccn1)N1CCCC1
InChI Key InChIKey=LWUYMBKCCILSCM-UHFFFAOYSA-N
Data  1 KI
  Tab Delimited (TSV)   2D SDfile   Computed 3D by Vconf -m prep SDfile
Find this compound or compounds like it in BindingDB:
Activity Spreadsheet -- Enzyme Inhibition Constant Data from BindingDB
Found 1 hit for monomerid = 50374113
TargetHistamine H3 receptor(Rattus norvegicus (rat))
Arena Pharmaceuticals
Curated by ChEMBL
LigandPNGBDBM50374113(CHEMBL255847)
Affinity DataKi:  36nM. Assay description: Displacement of N-[3H]methylhistamine from histamine H3 receptor in rat cortex
In DepthDetails ArticlePubMed