BDBM50374288 CHEMBL272798
SMILES O=C([C@@H]1CCCN1CCCc1ccccc1)N1CCC[C@H]1C(=O)c1ncc[nH]1
InChI Key InChIKey=OFKFFYKVZCMSNO-OALUTQOASA-N
Data  1 IC50
  Tab Delimited (TSV)   2D SDfile   Computed 3D by Vconf -m prep SDfile
Find this compound or compounds like it in BindingDB:
Activity Spreadsheet -- Enzyme Inhibition Constant Data from BindingDB
Found 1 hit for monomerid = 50374288
TargetProlyl endopeptidase(Sus scrofa)
Johnson & Johnson Pharmaceutical Research & Development
Curated by ChEMBL
LigandPNGBDBM50374288(CHEMBL272798)
Affinity DataIC50:  9nM. Assay description: Inhibition of pig kidney PEP
In DepthDetails ArticlePubMed