BDBM50374482 CHEMBL413070
SMILES Cc1ccccc1N=C(NC#N)N1CCN(C(C1)c1ccccc1)C(=O)Cc1cccs1
InChI Key InChIKey=GGVKMOBMFZGZAT-UHFFFAOYSA-N
Data  2 IC50
  Tab Delimited (TSV)   2D SDfile   Computed 3D by Vconf -m prep SDfile
Find this compound or compounds like it in BindingDB:
Activity Spreadsheet -- Enzyme Inhibition Constant Data from BindingDB
Found 2 hits for monomerid = 50374482
TargetP2X purinoceptor 7(Rattus norvegicus (Rat))
Abbott Bioresearch Center
Curated by ChEMBL
LigandPNGBDBM50374482(CHEMBL413070)
Affinity DataIC50:  150nM. Assay description: Antagonist activity at rat recombinant P2X7 receptor assessed as inhibition of calcium flux by FLIPR assay
In DepthDetails ArticlePubMed
TargetP2X purinoceptor 7(Homo sapiens (Human))
Abbott Bioresearch Center
Curated by ChEMBL
LigandPNGBDBM50374482(CHEMBL413070)
Affinity DataIC50:  46nM. Assay description: Antagonist activity at human recombinant P2X7 receptor assessed as inhibition of calcium flux by FLIPR assay
In DepthDetails ArticlePubMed