BDBM50374509 CHEMBL403403
SMILES CCCOC(=O)[C@H]1O[C@H](O)[C@@H](O)[C@H](O)[C@H]1O[C@@H]1O[C@@H](CO)[C@H](O[C@H]2O[C@@H]([C@H](O[C@@H]3O[C@@H](CO)[C@H](O)[C@@H](O)[C@@H]3N)[C@@H](O)[C@@H]2O)C(O)=O)[C@@H](O)[C@@H]1N
InChI Key InChIKey=JMZRPVJYLHSHBP-MONAAHRESA-N
Data  1 IC50
  Tab Delimited (TSV)   2D SDfile   Computed 3D by Vconf -m prep SDfile
Find this compound or compounds like it in BindingDB:
Activity Spreadsheet -- Enzyme Inhibition Constant Data from BindingDB
Found 1 hit for monomerid = 50374509
TargetFibroblast growth factor 1(Homo sapiens (Human))
Progen Pharmaceuticals
Curated by ChEMBL
LigandPNGBDBM50374509(CHEMBL403403)
Affinity DataIC50:  2.90E+5nM. Assay description: Binding affinity at FGF1
In DepthDetails ArticlePubMed