BDBM50374661 CHEMBL402306
SMILES CN(C)CCNC(=O)c1cccc(Nc2nc3Nc4cccc(NC(=O)CCCCc5cnn2c5n3)c4)c1
InChI Key InChIKey=RHLSVEXDNGVVDO-UHFFFAOYSA-N
Data  1 KI
  Tab Delimited (TSV)   2D SDfile   Computed 3D by Vconf -m prep SDfile
Find this compound or compounds like it in BindingDB:
Activity Spreadsheet -- Enzyme Inhibition Constant Data from BindingDB
Found 1 hit for monomerid = 50374661
TargetCasein kinase II subunit alpha(Zea mays (Maize))
Polaris Pharmaceuticals
Curated by ChEMBL
LigandPNGBDBM50374661(CHEMBL402306)
Affinity DataKi:  5.20nM. Assay description: Inhibition of corn CK2
In DepthDetails ArticlePubMed