BDBM50374717 CHEMBL271310
SMILES CC(C)c1c(cn2ncnc(Nc3cc(C(=O)NC4CC4)c(F)cc3F)c12)-c1nnc(NCCCN(C)C)o1
InChI Key InChIKey=NATXHFKXFMNQDO-UHFFFAOYSA-N
Data  8 IC50
  Tab Delimited (TSV)   2D SDfile   Computed 3D by Vconf -m prep SDfile
Find this compound or compounds like it in BindingDB:
Activity Spreadsheet -- Enzyme Inhibition Constant Data from BindingDB
Found 8 hits for monomerid = 50374717
TargetCytochrome P450 3A4(Homo sapiens (Human))
Bristol-Myers Squibb Research And Development
Curated by ChEMBL
LigandPNGBDBM50374717(CHEMBL271310)
Affinity DataIC50:  2.90E+4nM. Assay description: Inhibition of human CYP3A4
In DepthDetails ArticlePubMed
TargetCytochrome P450 1A2(Homo sapiens (Human))
Bristol-Myers Squibb Research And Development
Curated by ChEMBL
LigandPNGBDBM50374717(CHEMBL271310)
Affinity DataIC50: >4.00E+4nM. Assay description: Inhibition of human CYP1A2
In DepthDetails ArticlePubMed
TargetCytochrome P450 2C9(Homo sapiens (Human))
Bristol-Myers Squibb Research And Development
Curated by ChEMBL
LigandPNGBDBM50374717(CHEMBL271310)
Affinity DataIC50:  3.90E+4nM. Assay description: Inhibition of human CYP2C9
In DepthDetails ArticlePubMed
TargetCytochrome P450 3A4(Homo sapiens (Human))
Bristol-Myers Squibb Research And Development
Curated by ChEMBL
LigandPNGBDBM50374717(CHEMBL271310)
Affinity DataIC50:  2.90E+4nM. Assay description: Inhibition of human CYP3A4 using 7-benzyloxyresorufin substrate
In DepthDetails ArticlePubMed
TargetCytochrome P450 3A4(Homo sapiens (Human))
Bristol-Myers Squibb Research And Development
Curated by ChEMBL
LigandPNGBDBM50374717(CHEMBL271310)
Affinity DataIC50:  3.70E+4nM. Assay description: Inhibition of human CYP3A4 using 7-benzyloxy-4-trifluoromethylcoumarin substrate
In DepthDetails ArticlePubMed
TargetVascular endothelial growth factor receptor 2(Homo sapiens (Human))
Bristol-Myers Squibb Research And Development
Curated by ChEMBL
LigandPNGBDBM50374717(CHEMBL271310)
Affinity DataIC50:  12nM. Assay description: Inhibition of VEGFR2
In DepthDetails ArticlePubMed
TargetCytochrome P450 2C19(Homo sapiens (Human))
Bristol-Myers Squibb Research And Development
Curated by ChEMBL
LigandPNGBDBM50374717(CHEMBL271310)
Affinity DataIC50: >4.00E+4nM. Assay description: Inhibition of human CYP2C19
In DepthDetails ArticlePubMed
TargetCytochrome P450 2D6(Homo sapiens (Human))
Bristol-Myers Squibb Research And Development
Curated by ChEMBL
LigandPNGBDBM50374717(CHEMBL271310)
Affinity DataIC50: >4.00E+4nM. Assay description: Inhibition of human CYP2D6
In DepthDetails ArticlePubMed