BDBM50374791 CHEMBL408941
SMILES Cc1cc(SCc2nc(ns2)-c2ccc(Cl)cc2Cl)ccc1OC(C)(C)C(O)=O
InChI Key InChIKey=QDHGUQJAWFDXPA-UHFFFAOYSA-N
Data  3 EC50
  Tab Delimited (TSV)   2D SDfile   Computed 3D by Vconf -m prep SDfile
Find this compound or compounds like it in BindingDB:
Activity Spreadsheet -- Enzyme Inhibition Constant Data from BindingDB
Found 3 hits for monomerid = 50374791
TargetPeroxisome proliferator-activated receptor gamma(Homo sapiens (Human))
Johnson & Johnson Pharmaceutical Research And Development
Curated by ChEMBL
LigandPNGBDBM50374791(CHEMBL408941)
Affinity DataEC50: >3.00E+3nM. Assay description: Agonist activity at human PPARgamma-Gal4 in HEK293 cells by luciferase reporter assay
In DepthDetails ArticlePubMed
TargetPeroxisome proliferator-activated receptor delta(Homo sapiens (Human))
Johnson & Johnson Pharmaceutical Research And Development
Curated by ChEMBL
LigandPNGBDBM50374791(CHEMBL408941)
Affinity DataEC50:  102nM. Assay description: Agonist activity at human PPARdelta-Gal4 in HEK293 cells by luciferase reporter assay
In DepthDetails ArticlePubMed
TargetPeroxisome proliferator-activated receptor alpha(Homo sapiens (Human))
Johnson & Johnson Pharmaceutical Research And Development
Curated by ChEMBL
LigandPNGBDBM50374791(CHEMBL408941)
Affinity DataEC50:  476nM. Assay description: Agonist activity at human PPARalpha-Gal4 in HEK293 cells by luciferase reporter assay
In DepthDetails ArticlePubMed