BDBM50374966 CHEMBL402524
SMILES C[C@H](Nc1cc(Nc2nccc(n2)-c2ccc(cc2)C(=O)NO)ccn1)c1ccccc1
InChI Key InChIKey=DOZYZCNUPNPALS-INIZCTEOSA-N
Data  1 IC50
  Tab Delimited (TSV)   2D SDfile   Computed 3D by Vconf -m prep SDfile
Find this compound or compounds like it in BindingDB:
Activity Spreadsheet -- Enzyme Inhibition Constant Data from BindingDB
Found 1 hit for monomerid = 50374966
LigandPNGBDBM50374966(CHEMBL402524)
Affinity DataIC50:  170nM. Assay description: Inhibition of cloned CaMK2delta
In DepthDetails ArticlePubMed