BDBM50375224 CHEMBL441895
SMILES CO[C@H]1[C@H](O)[C@@H](N)[C@@H](O[C@H]2[C@H](O)[C@@H](O)[C@H](OC[C@@H](O)[C@@H](O)[C@H](O)[C@@H](O)CNc3cccc(NC(=O)CCCCC4CCSS4)c3)O[C@@H]2C([O-])=O)O[C@@H]1COS([O-])(=O)=O
InChI Key InChIKey=REVINFGDKMEOJT-CXGDSEDUSA-L
Data  1 Kd
  Tab Delimited (TSV)   2D SDfile   Computed 3D by Vconf -m prep SDfile
Find this compound or compounds like it in BindingDB:
Activity Spreadsheet -- Enzyme Inhibition Constant Data from BindingDB
Found 1 hit for monomerid = 50375224
TargetIsoform 1 of Fibronectin (1)(Homo sapiens (Human))
Kagoshima University
Curated by ChEMBL
LigandPNGBDBM50375224(CHEMBL441895)
Affinity DataKd:  33nM. Assay description: Binding affinity to fibronectin using surface plasmon resonance imaging sensor method
In DepthDetails ArticlePubMed