BDBM50375510 CHEMBL405957
SMILES OC[C@@H]1N[C@@H](CO)[C@H](O)[C@H]1O
InChI Key InChIKey=PFYHYHZGDNWFIF-BXKVDMCESA-N
Data  6 IC50
  Tab Delimited (TSV)   2D SDfile   Computed 3D by Vconf -m prep SDfile
Find this compound or compounds like it in BindingDB:
Activity Spreadsheet -- Enzyme Inhibition Constant Data from BindingDB
Found 6 hits for monomerid = 50375510
TargetSucrase-isomaltase, intestinal(Rattus norvegicus (Rat))
Hokuriku University
Curated by ChEMBL
LigandPNGBDBM50375510(CHEMBL405957)
Affinity DataIC50:  1.40E+3nM. Assay description: Inhibition of rat intestinal maltase
In DepthDetails ArticlePubMed
TargetSucrase-isomaltase, intestinal(Rattus norvegicus (Rat))
Hokuriku University
Curated by ChEMBL
LigandPNGBDBM50375510(CHEMBL405957)
Affinity DataIC50:  40nM. Assay description: Inhibition of rat isomaltase
In DepthDetails ArticlePubMed
TargetLysosomal alpha-glucosidase(Rattus norvegicus)
University Of Toyama
Curated by ChEMBL
LigandPNGBDBM50375510(CHEMBL405957)
Affinity DataIC50:  1.20E+3nM. Assay description: Inhibition of rat intestinal maltase using moltose as substrate
In DepthDetails ArticlePubMed
TargetSucrase-isomaltase, intestinal(Rattus norvegicus (Rat))
Hokuriku University
Curated by ChEMBL
LigandPNGBDBM50375510(CHEMBL405957)
Affinity DataIC50:  620nM. Assay description: Inhibition of rat intestinal sucrase using sucrose as substrate
In DepthDetails ArticlePubMed
TargetSucrase-isomaltase, intestinal(Rattus norvegicus (Rat))
Hokuriku University
Curated by ChEMBL
LigandPNGBDBM50375510(CHEMBL405957)
Affinity DataIC50:  770nM. Assay description: Inhibition of rat intestinal isomaltase using isomoltose as substrate
In DepthDetails ArticlePubMed
TargetSucrase-isomaltase, intestinal(Rattus norvegicus (Rat))
Hokuriku University
Curated by ChEMBL
LigandPNGBDBM50375510(CHEMBL405957)
Affinity DataIC50:  100nM. Assay description: Inhibition of rat sucrase
In DepthDetails ArticlePubMed