BDBM50375585 CHEMBL271208
SMILES C[C@H](CCC(=O)NCC(O)=O)[C@H]1CC[C@H]2[C@@H]3C[C@H](O)[C@@H]4C[C@H](O)CC[C@]4(C)[C@H]3CC[C@]12C
InChI Key InChIKey=SPOIYSFQOFYOFZ-BRDORRHWSA-N
Data  1 EC50
  Tab Delimited (TSV)   2D SDfile   Computed 3D by Vconf -m prep SDfile
Find this compound or compounds like it in BindingDB:
Activity Spreadsheet -- Enzyme Inhibition Constant Data from BindingDB
Found 1 hit for monomerid = 50375585
TargetG-protein coupled bile acid receptor 1(Homo sapiens (Human))
Centre National de la Recherche Scientifique/INSERM/ULP
Curated by ChEMBL
LigandPNGBDBM50375585(CHEMBL271208)
Affinity DataEC50:  3.67E+4nM. Assay description: Agonist activity at human TGR5 expressed in CHO cells by luciferase assay
In DepthDetails ArticlePubMed