BDBM50375596 HDCA::hyodeoxycholic acid
SMILES C[C@H](CCC(O)=O)[C@H]1CC[C@H]2[C@@H]3C[C@H](O)[C@@H]4C[C@H](O)CC[C@]4(C)[C@H]3CC[C@]12C
InChI Key InChIKey=DGABKXLVXPYZII-SIBKNCMHSA-N
Data  2 IC50  3 EC50
  Tab Delimited (TSV)   2D SDfile   Computed 3D by Vconf -m prep SDfile
Find this compound or compounds like it in BindingDB:
Activity Spreadsheet -- Enzyme Inhibition Constant Data from BindingDB
Found 5 hits for monomerid = 50375596
TargetVitamin D3 receptor(Homo sapiens (Human))
University Of Wisconsin
Curated by ChEMBL
LigandPNGBDBM50375596(HDCA | hyodeoxycholic acid)
Affinity DataIC50: >1.50E+5nM. Assay description: Antagonist activity against VP16 tagged-VDR-LBD (unknown origin) expressed in HEK293T cells assessed as inhibition of 1,25-dihydroxyvitamin D3-induce...
In DepthDetails ArticlePubMed
TargetVitamin D3 receptor(Homo sapiens (Human))
University Of Wisconsin
Curated by ChEMBL
LigandPNGBDBM50375596(HDCA | hyodeoxycholic acid)
Affinity DataIC50: >5.00E+4nM. Assay description: Agonist activity at human VP16 tagged-VDR-LBD after 16 hrs by luciferase reporter gene based transcription assay
In DepthDetails ArticlePubMed
TargetG-protein coupled bile acid receptor 1(Homo sapiens (Human))
Centre National de la Recherche Scientifique/INSERM/ULP
Curated by ChEMBL
LigandPNGBDBM50375596(HDCA | hyodeoxycholic acid)
Affinity DataEC50:  3.16E+4nM. Assay description: Agonist activity at human TGR5 expressed in CHO cells by luciferase assay
In DepthDetails ArticlePubMed
TargetVitamin D3 receptor(Homo sapiens (Human))
University Of Wisconsin
Curated by ChEMBL
LigandPNGBDBM50375596(HDCA | hyodeoxycholic acid)
Affinity DataEC50: >1.50E+5nM. Assay description: Agonist activity at VDR-LBD (unknown origin) expressed in Escherichia coli assessed as SRC2-3 coactivator peptide recruitment after 30 mins by fluore...
In DepthDetails ArticlePubMed
TargetVitamin D3 receptor(Homo sapiens (Human))
University Of Wisconsin
Curated by ChEMBL
LigandPNGBDBM50375596(HDCA | hyodeoxycholic acid)
Affinity DataEC50: >1.50E+5nM. Assay description: Agonist activity at VP16 tagged-VDR-LBD (unknown origin) expressed in HEK293T cells assessed as SRC1 coactivator peptide recruitment after 16 hrs by ...
In DepthDetails ArticlePubMed