BDBM50375608 CHEMBL406220
SMILES CO[C@@H]([C@H](O)CC(=O)[C@@H](C)[C@@H](O)CC[C@@H](C)[C@@H]1O[C@]2(CC[C@@H](C)[C@H](CC[C@H](C)C(C)=O)O2)CC[C@@H]1C)[C@H](OC(=O)C[C@@H](O)C(\C(O)=O)=C(/C)C(O)=O)C(C)C
InChI Key InChIKey=FLYBGKSOQRCWMB-SPVJCFRKSA-N
Data  1 KI
PDB links: 1 PDB ID matches this monomer.
  Tab Delimited (TSV)   2D SDfile   Computed 3D by Vconf -m prep SDfile
Find this compound or compounds like it in BindingDB:
Activity Spreadsheet -- Enzyme Inhibition Constant Data from BindingDB
Found 1 hit for monomerid = 50375608
TargetSerine/threonine-protein phosphatase PP1-gamma catalytic subunit(Homo sapiens (Human))
Nagoya University
Curated by ChEMBL
LigandPNGBDBM50375608(CHEMBL406220)
Affinity DataKi:  4.5nM. Assay description: Inhibition of PP1gamma by firefly bioluminescence assay