BDBM50375778 CHEMBL221982
SMILES CCCc1cn([C@H]2C[C@H](O)[C@@H](CO)O2)c(=O)[nH]c1=O
InChI Key InChIKey=MBERTAKFBYOAHR-IVZWLZJFSA-N
Data  2 KI  1 IC50
  Tab Delimited (TSV)   2D SDfile   Computed 3D by Vconf -m prep SDfile
Find this compound or compounds like it in BindingDB:
Activity Spreadsheet -- Enzyme Inhibition Constant Data from BindingDB
Found 3 hits for monomerid = 50375778
TargetThymidine kinase, cytosolic(Homo sapiens (Human))
TBA
Curated by ChEMBL
LigandPNGBDBM50375778(CHEMBL221982)
Affinity DataKi:  2.00E+4nM. Assay description: Inhibition of human cytoplasmic thymidine kinase
In DepthDetails ArticlePubMed
TargetThymidine kinase 2, mitochondrial(Homo sapiens (Human))
TBA
Curated by ChEMBL
LigandPNGBDBM50375778(CHEMBL221982)
Affinity DataKi:  2.00E+4nM. Assay description: Inhibition of human mitochondrial thymidine kinase
In DepthDetails ArticlePubMed
TargetThymidine kinase(Macacine herpesvirus 1)
Glsynthesis
Curated by ChEMBL
LigandPNGBDBM50375778(CHEMBL221982)
Affinity DataIC50:  4.20E+3nM. Assay description: Inhibition of Herpes B virus recombinant thymidine kinase-mediated [3H]TdR phosphorylation
In DepthDetails ArticlePubMed