BDBM50375812 CHEMBL258896::XR-9504
SMILES COc1cc2CCN(CCc3ccc(NC(=O)c4ccccc4NC(=O)c4ccc(C)cc4)cc3)Cc2cc1OC
InChI Key InChIKey=YKXTXQJFMGBJLD-UHFFFAOYSA-N
Data  4 IC50
  Tab Delimited (TSV)   2D SDfile   Computed 3D by Vconf -m prep SDfile
Find this compound or compounds like it in BindingDB:
Activity Spreadsheet -- Enzyme Inhibition Constant Data from BindingDB
Found 4 hits for monomerid = 50375812
TargetATP-dependent translocase ABCB1(Mus musculus)
University Of Bonn
Curated by ChEMBL
LigandPNGBDBM50375812(CHEMBL258896 | XR-9504)
Affinity DataIC50:  260nM. Assay description: Inhibition of mouse Pgp in EMT6/AR1.0 cells after 1 hr by daunorubicin accumulation assay
In DepthDetails ArticlePubMed
TargetBroad substrate specificity ATP-binding cassette transporter ABCG2(Homo sapiens (Human))
University Of Bonn
Curated by ChEMBL
LigandPNGBDBM50375812(CHEMBL258896 | XR-9504)
Affinity DataIC50:  3.89E+3nM. Assay description: Inhibition of ABCG2 in human mitoxantrone-resistant MCF7 cells by Hoechst 33342 assay
In DepthDetails ArticlePubMed
TargetATP-dependent translocase ABCB1(Homo sapiens (Human))
University Of Bonn
Curated by ChEMBL
LigandPNGBDBM50375812(CHEMBL258896 | XR-9504)
Affinity DataIC50:  525nM. Assay description: Inhibition of human Pgp in A2780 cells after 30 mins by Hoechst 33342 assay
In DepthDetails ArticlePubMed
TargetATP-dependent translocase ABCB1(Homo sapiens (Human))
University Of Bonn
Curated by ChEMBL
LigandPNGBDBM50375812(CHEMBL258896 | XR-9504)
Affinity DataIC50:  692nM. Assay description: Inhibition of human Pgp in A2780 cells after 30 mins by calcein AM assay
In DepthDetails ArticlePubMed