BDBM50375869 CHEMBL261494::JWH-407
SMILES CCCCC(C)(C)c1ccc(cc1)[C@@H]1CCC[C@@H](O)C1
InChI Key InChIKey=WMICXNJEJDOUPN-SJLPKXTDSA-N
Data  2 KI
  Tab Delimited (TSV)   2D SDfile   Computed 3D by Vconf -m prep SDfile
Find this compound or compounds like it in BindingDB:
Activity Spreadsheet -- Enzyme Inhibition Constant Data from BindingDB
Found 2 hits for monomerid = 50375869
TargetCannabinoid receptor 2(Homo sapiens (Human))
Clemson University
Curated by ChEMBL
LigandPNGBDBM50375869(CHEMBL261494 | JWH-407)
Affinity DataKi:  546nM. Assay description: Displacement of [3H]CP-55940 from human cloned CB2 receptor
In DepthDetails ArticlePubMed
TargetCannabinoid receptor 1(Rattus norvegicus (rat))
Clemson University
Curated by ChEMBL
LigandPNGBDBM50375869(CHEMBL261494 | JWH-407)
Affinity DataKi:  1.73E+3nM. Assay description: Displacement of [3H]CP-55940 from CB1 receptor in Sprague-Dawley rat brain membrane
In DepthDetails ArticlePubMed