BDBM50375880 CHEMBL405449
SMILES CCOC(=O)c1cn(Cc2c(F)cccc2F)c2cc(c(CN(C)Cc3ccccc3)cc2c1=O)-c1ccc(NC(=O)CC)cc1
InChI Key InChIKey=JBODSIHHJZNESW-UHFFFAOYSA-N
Data  1 KI
  Tab Delimited (TSV)   2D SDfile   Computed 3D by Vconf -m prep SDfile
Find this compound or compounds like it in BindingDB:
Activity Spreadsheet -- Enzyme Inhibition Constant Data from BindingDB
Found 1 hit for monomerid = 50375880
TargetGonadotropin-releasing hormone receptor(Homo sapiens (Human))
Neurocrine Biosciences
Curated by ChEMBL
LigandPNGBDBM50375880(CHEMBL405449)
Affinity DataKi:  50nM. Assay description: Inhibition of GnRH receptor
In DepthDetails ArticlePubMed