BDBM50375918 CHEMBL261233
SMILES [O-][N+](=O)c1ccc(cc1)N1CCN(CCC(=O)NCc2nc3ccccc3c(=O)n2-c2ccccc2)CC1
InChI Key InChIKey=DQXBPSXFEGCRON-UHFFFAOYSA-N
Data  1 IC50
  Tab Delimited (TSV)   2D SDfile   Computed 3D by Vconf -m prep SDfile
Find this compound or compounds like it in BindingDB:
Activity Spreadsheet -- Enzyme Inhibition Constant Data from BindingDB
Found 1 hit for monomerid = 50375918
Target5-hydroxytryptamine receptor 7(Homo sapiens (Human))
Institute Of Science And Technology
Curated by ChEMBL
LigandPNGBDBM50375918(CHEMBL261233)
Affinity DataIC50: >1.00E+4nM. Assay description: Displacement of [3H]LSD from human recombinant 5HT7 receptor
In DepthDetails ArticlePubMed