BDBM50376073 CHEMBL265194
SMILES Cc1nc2ncnc(N3CCC(N)CC3)c2[nH]1
InChI Key InChIKey=VNNDRKUYJKCTAU-UHFFFAOYSA-N
Data  1 IC50
  Tab Delimited (TSV)   2D SDfile   Computed 3D by Vconf -m prep SDfile
Find this compound or compounds like it in BindingDB:
Activity Spreadsheet -- Enzyme Inhibition Constant Data from BindingDB
Found 1 hit for monomerid = 50376073
TargetRAC-beta serine/threonine-protein kinase(Homo sapiens (Human))
The Institute Of Cancer Research
Curated by ChEMBL
LigandPNGBDBM50376073(CHEMBL265194)
Affinity DataIC50:  1.10E+5nM. Assay description: Inhibition of PKBbeta recombinant by radiometric filter binding assay
In DepthDetails ArticlePubMed